BDBM412528 (8-((1S,4S)-2-oxa-5- azabicyclo[2.2.1]heptan-5-yl)-3- fluoro-5,11-dihydro-6H- benzo[b]pyrido[2,3- e][1,4]diazepin-6-yl)(cis-4- isopropoxycyclohexyl)methanone::US10399972, Example 19
SMILES CC(C)O[C@H]1CC[C@H](CC1)C(=O)N1Cc2cc(F)cnc2Nc2ccc(cc12)N1C[C@@H]2C[C@H]1CO2
InChI Key InChIKey=WEALFDMDNWSPJG-QMZRJTEUSA-N
Data  1 IC50
  Tab Delimited (TSV)   2D SDfile   Computed 3D by Vconf -m prep SDfile
Find this compound or compounds like it in BindingDB:
Activity Spreadsheet -- Enzyme Inhibition Constant Data from BindingDB
Found 1 hit for monomerid = 412528
TargetIsocitrate dehydrogenase [NADP] cytoplasmic [R132H](Homo sapiens (Human))
Merck Sharp & Dohme
US Patent
LigandPNGBDBM412528((8-((1S,4S)-2-oxa-5- azabicyclo[2.2.1]heptan-5-yl)...)
Affinity DataIC50:  6nM. Assay description: Each test compound (10 mM stock in DMSO) is diluted in DMSO to make a 10-point, 3-fold dilution series. 125 nL of each dilution or DMSO alone is disp...
Ligand Info
In DepthDetails US Patent