BDBM412579 US10399972, Example 70
SMILES CC(C)O[C@H]1CCC(CC1)C(=O)N1Cc2cc(cnc2Nc2ccc(cc12)N1C[C@@H]2CC[C@H]1CO2)S(C)(=O)=O
InChI Key InChIKey=SXAQTJPWGFWVIQ-RXUSZAQGSA-N
Data  1 IC50
  Tab Delimited (TSV)   2D SDfile   Computed 3D by Vconf -m prep SDfile
Find this compound or compounds like it in BindingDB:
Activity Spreadsheet -- Enzyme Inhibition Constant Data from BindingDB
Found 1 hit for monomerid = 412579
TargetIsocitrate dehydrogenase [NADP] cytoplasmic [R132H](Homo sapiens (Human))
Merck Sharp & Dohme
US Patent
LigandPNGBDBM412579(US10399972, Example 70)
Affinity DataIC50:  5.75E+3nM. Assay description: Each test compound (10 mM stock in DMSO) is diluted in DMSO to make a 10-point, 3-fold dilution series. 125 nL of each dilution or DMSO alone is disp...
Ligand Info
In DepthDetails US Patent