BDBM41258 MLS000065400::N-(1,2-oxazol-3-yl)-2-phenyl-quinoline-4-carboxamide::N-(1,2-oxazol-3-yl)-2-phenylquinoline-4-carboxamide::N-(3-isoxazolyl)-2-phenyl-4-quinolinecarboxamide::N-3-isoxazolyl-2-phenyl-4-quinolinecarboxamide::N-isoxazol-3-yl-2-phenyl-cinchoninamide::SMR000079192::cid_899144
SMILES O=C(Nc1ccon1)c1cc(nc2ccccc12)-c1ccccc1
InChI Key InChIKey=CDDDIKSIXQVQAT-UHFFFAOYSA-N
Data  3 IC50
  Tab Delimited (TSV)   2D SDfile   Computed 3D by Vconf -m prep SDfile
Find this compound or compounds like it in BindingDB:
Activity Spreadsheet -- Enzyme Inhibition Constant Data from BindingDB
Found 3 hits for monomerid = 41258
TargetDNA-directed RNA polymerase subunit beta(Escherichia coli)
Pcmd
Curated by PubChem BioAssay
LigandPNGBDBM41258(MLS000065400 | N-(1,2-oxazol-3-yl)-2-phenyl-quinol...)
Affinity DataIC50: >5.00E+4nM. Assay description: Screening Center: Penn Center for Molecular Discovery Center Affiliation: University of Pennsylvania Network: Molecular Library Screening Center Netw...
In DepthDetails PCBioAssay
TargetUrea transporter 1(Rattus norvegicus (Rat))
San Francisco State University
Curated by ChEMBL
LigandPNGBDBM41258(MLS000065400 | N-(1,2-oxazol-3-yl)-2-phenyl-quinol...)
Affinity DataIC50: >1.00E+5nM. Assay description: Inhibition of rat UT-B incubated for 15 mins
In DepthDetails ArticlePubMed
TargetUrea transporter 2(Rattus norvegicus (Rat))
San Francisco State University
Curated by ChEMBL
LigandPNGBDBM41258(MLS000065400 | N-(1,2-oxazol-3-yl)-2-phenyl-quinol...)
Affinity DataIC50:  2.00E+3nM. Assay description: Inhibition of rat UT-A1 expressed in MDCK cells incubated for 15 mins by fluorescence plate reader assay
In DepthDetails ArticlePubMed