BDBM41259 2-[2-(1-benzofuran-2-yl)-2-oxidanylidene-ethyl]sulfanyl-3,6-dimethyl-thieno[2,3-d]pyrimidin-4-one::2-[2-(1-benzofuran-2-yl)-2-oxoethyl]sulfanyl-3,6-dimethylthieno[2,3-d]pyrimidin-4-one::2-[[2-(2-benzofuranyl)-2-oxoethyl]thio]-3,6-dimethyl-4-thieno[2,3-d]pyrimidinone::2-[[2-(benzofuran-2-yl)-2-keto-ethyl]thio]-3,6-dimethyl-thieno[2,3-d]pyrimidin-4-one::2-{[2-(1-benzofuran-2-yl)-2-oxoethyl]thio}-3,6-dimethylthieno[2,3-d]pyrimidin-4(3H)-one::MLS000100040::SMR000081744::cid_2231322
SMILES Cc1cc2c(nc(SCC(=O)c3cc4ccccc4o3)n(C)c2=O)s1
InChI Key InChIKey=WZQXODBLOYTWEH-UHFFFAOYSA-N
Data  1 IC50
  Tab Delimited (TSV)   2D SDfile   Computed 3D by Vconf -m prep SDfile
Find this compound or compounds like it in BindingDB:
Activity Spreadsheet -- Enzyme Inhibition Constant Data from BindingDB
Found 1 hit for monomerid = 41259
TargetDNA-directed RNA polymerase subunit beta(Escherichia coli)
Pcmd
Curated by PubChem BioAssay
LigandPNGBDBM41259(2-[2-(1-benzofuran-2-yl)-2-oxidanylidene-ethyl]sul...)
Affinity DataIC50: >5.00E+4nM. Assay description: Screening Center: Penn Center for Molecular Discovery Center Affiliation: University of Pennsylvania Network: Molecular Library Screening Center Netw...
In DepthDetails PCBioAssay