BDBM41260 MLS000049792::N-[[3-(4-chlorophenyl)-1,2,4-oxadiazol-5-yl]methyl]-2-[(4-chlorophenyl)sulfonyl-methyl-amino]-N-isopropyl-acetamide::N-[[3-(4-chlorophenyl)-1,2,4-oxadiazol-5-yl]methyl]-2-[(4-chlorophenyl)sulfonyl-methyl-amino]-N-propan-2-yl-ethanamide::N-[[3-(4-chlorophenyl)-1,2,4-oxadiazol-5-yl]methyl]-2-[(4-chlorophenyl)sulfonyl-methylamino]-N-propan-2-ylacetamide::N~1~-{[3-(4-chlorophenyl)-1,2,4-oxadiazol-5-yl]methyl}-N~2~-[(4-chlorophenyl)sulfonyl]-N~1~-isopropyl-N~2~-methylglycinamide::SMR000077892::cid_2216008
SMILES CC(C)N(Cc1nc(no1)-c1ccc(Cl)cc1)C(=O)CN(C)S(=O)(=O)c1ccc(Cl)cc1
InChI Key InChIKey=CVTQYKKWQJBSSM-UHFFFAOYSA-N
Data  1 IC50  1 EC50
  Tab Delimited (TSV)   2D SDfile   Computed 3D by Vconf -m prep SDfile
Find this compound or compounds like it in BindingDB:
Activity Spreadsheet -- Enzyme Inhibition Constant Data from BindingDB
Found 2 hits for monomerid = 41260
TargetHeat shock factor protein 1(Mus musculus)
Broad Institute
Curated by PubChem BioAssay
LigandPNGBDBM41260(MLS000049792 | N-[[3-(4-chlorophenyl)-1,2,4-oxadia...)
Affinity DataEC50: >2.60E+5nM. Assay description: Keywords: Heat Shock Factor-1 (HSF-1), Stress Response, MG132, NIH3T3, Luminescence Assay Overview: Confirmation testing of small molecules identifie...
In DepthDetails PCBioAssay
TargetDNA-directed RNA polymerase subunit beta(Escherichia coli)
Pcmd
Curated by PubChem BioAssay
LigandPNGBDBM41260(MLS000049792 | N-[[3-(4-chlorophenyl)-1,2,4-oxadia...)
Affinity DataIC50: >5.00E+4nM. Assay description: Screening Center: Penn Center for Molecular Discovery Center Affiliation: University of Pennsylvania Network: Molecular Library Screening Center Netw...
In DepthDetails PCBioAssay