BDBM41261 MLS000100032::N-(1,1-diketothiolan-3-yl)-4-(2-ketopyrrolidino)-N-methyl-benzenesulfonamide::N-(1,1-dioxidotetrahydro-3-thienyl)-N-methyl-4-(2-oxo-1-pyrrolidinyl)benzenesulfonamide::N-(1,1-dioxo-3-thiolanyl)-N-methyl-4-(2-oxo-1-pyrrolidinyl)benzenesulfonamide::N-(1,1-dioxothiolan-3-yl)-N-methyl-4-(2-oxopyrrolidin-1-yl)benzenesulfonamide::N-[1,1-bis(oxidanylidene)thiolan-3-yl]-N-methyl-4-(2-oxidanylidenepyrrolidin-1-yl)benzenesulfonamide::SMR000081718::cid_2976047
SMILES CN(C1CCS(=O)(=O)C1)S(=O)(=O)c1ccc(cc1)N1CCCC1=O
InChI Key InChIKey=BQDNLNUNGNWGEI-UHFFFAOYSA-N
Data  1 IC50
  Tab Delimited (TSV)   2D SDfile   Computed 3D by Vconf -m prep SDfile
Find this compound or compounds like it in BindingDB:
Activity Spreadsheet -- Enzyme Inhibition Constant Data from BindingDB
Found 1 hit for monomerid = 41261
TargetDNA-directed RNA polymerase subunit beta(Escherichia coli)
Pcmd
Curated by PubChem BioAssay
LigandPNGBDBM41261(MLS000100032 | N-(1,1-diketothiolan-3-yl)-4-(2-ket...)
Affinity DataIC50: >5.00E+4nM. Assay description: Screening Center: Penn Center for Molecular Discovery Center Affiliation: University of Pennsylvania Network: Molecular Library Screening Center Netw...
In DepthDetails PCBioAssay