BDBM412612 1-(2-((2-ethoxy-4-(4-methyl-4H-1,2,4-triazol-3-yl)phenyl)amino)-6-methylpyrido[3,4-d]pyrimidin-8-yl)piperidine-4-carbonitrile::US10399974, Example 5
SMILES CCOc1cc(ccc1Nc1ncc2cc(C)nc(N3CCC(CC3)C#N)c2n1)-c1nncn1C
InChI Key InChIKey=PSQDIYBEEUCIJT-UHFFFAOYSA-N
Data  1 IC50
  Tab Delimited (TSV)   2D SDfile   Computed 3D by Vconf -m prep SDfile
Find this compound or compounds like it in BindingDB:
Activity Spreadsheet -- Enzyme Inhibition Constant Data from BindingDB
Found 1 hit for monomerid = 412612
TargetDual specificity protein kinase TTK(Homo sapiens (Human))
Cancer Research Technology
US Patent
LigandPNGBDBM412612(1-(2-((2-ethoxy-4-(4-methyl-4H-1,2,4-triazol-3-yl)...)
Affinity DataIC50:  3nM. Assay description: The enzyme reaction (total volume 10 μl) was carried out in black 384-well low volume plates containing full length MPS1 (12.5 nM or 3 nM), fluo...
Ligand Info
In DepthDetails US Patent