BDBM412725 2-Methyl-6-((1-methyl- 4-phenyl-1H-imidazol- 2- yl)methoxy)imidazo [1,2-b]pyridazine::Roche-Dataset for PDE10A, Compound 445::US10399985, Example 38
SMILES Cc1cn2nc(OCc3nc(cn3C)-c3ccccc3)ccc2n1
InChI Key InChIKey=SHDFNAJLHSGXKE-UHFFFAOYSA-N
Data  2 IC50
  Tab Delimited (TSV)   2D SDfile   Computed 3D by Vconf -m prep SDfile
Find this compound or compounds like it in BindingDB:
Activity Spreadsheet -- Enzyme Inhibition Constant Data from BindingDB
Found 2 hits for monomerid = 412725
TargetcAMP and cAMP-inhibited cGMP 3',5'-cyclic phosphodiesterase 10A(Homo sapiens (Human))
F. Hoffmann-La Roche
LigandPNGBDBM412725(2-Methyl-6-((1-methyl- 4-phenyl-1H-imidazol- 2- yl...)
Affinity DataIC50:  132nM. Assay description: Human PDE10A IC50 values were determined by using purified enzyme (Biomol cat. # SE-534) in a scintillation proximity assay (SPA) in 96 well plates (...
Ligand Info
In DepthDetails ArticlePubMed
TargetcAMP and cAMP-inhibited cGMP 3',5'-cyclic phosphodiesterase 10A(Homo sapiens (Human))
F. Hoffmann-La Roche
LigandPNGBDBM412725(2-Methyl-6-((1-methyl- 4-phenyl-1H-imidazol- 2- yl...)
Affinity DataIC50:  133nM. Assay description: The following test was carried out in order to determine the activity of the compounds of the present invention. PDE10 activity of the compounds of t...
Ligand Info
In DepthDetails US Patent