BDBM412726 3-Methyl-6-((1-methyl- 4-phenyl-1H-imidazol- 2- yl)methoxy)imidazo [1,2-b]pyridazine-2- carboxamide::Roche-Dataset for PDE10A, Compound 128::US10399985, Example 39
SMILES Cc1c(nc2ccc(OCc3nc(cn3C)-c3ccccc3)nn12)C(N)=O
InChI Key InChIKey=ADSWKXZPKJGVSF-UHFFFAOYSA-N
Data  2 IC50
  Tab Delimited (TSV)   2D SDfile   Computed 3D by Vconf -m prep SDfile
Find this compound or compounds like it in BindingDB:
Activity Spreadsheet -- Enzyme Inhibition Constant Data from BindingDB
Found 2 hits for monomerid = 412726
TargetcAMP and cAMP-inhibited cGMP 3',5'-cyclic phosphodiesterase 10A(Homo sapiens (Human))
F. Hoffmann-La Roche
LigandPNGBDBM412726(3-Methyl-6-((1-methyl- 4-phenyl-1H-imidazol- 2- yl...)
Affinity DataIC50:  114nM. Assay description: Human PDE10A IC50 values were determined by using purified enzyme (Biomol cat. # SE-534) in a scintillation proximity assay (SPA) in 96 well plates (...
Ligand Info
In DepthDetails ArticlePubMed
TargetcAMP and cAMP-inhibited cGMP 3',5'-cyclic phosphodiesterase 10A(Homo sapiens (Human))
F. Hoffmann-La Roche
LigandPNGBDBM412726(3-Methyl-6-((1-methyl- 4-phenyl-1H-imidazol- 2- yl...)
Affinity DataIC50:  114nM. Assay description: The following test was carried out in order to determine the activity of the compounds of the present invention. PDE10 activity of the compounds of t...
Ligand Info
In DepthDetails US Patent