BDBM41286 1-[1-(1-Cyclopentyl-1H-tetrazol-5-yl)-2-methyl-propyl]-1,2,3,4-tetrahydro-quinoline::1-[1-(1-cyclopentyl-1,2,3,4-tetrazol-5-yl)-2-methyl-propyl]-3,4-dihydro-2H-quinoline::1-[1-(1-cyclopentyl-5-tetrazolyl)-2-methylpropyl]-3,4-dihydro-2H-quinoline::1-[1-(1-cyclopentyltetrazol-5-yl)-2-methyl-propyl]-3,4-dihydro-2H-quinoline::1-[1-(1-cyclopentyltetrazol-5-yl)-2-methylpropyl]-3,4-dihydro-2H-quinoline::MLS000027129::SMR000002425::cid_651401
SMILES CC(C)C(N1CCCc2ccccc12)c1nnnn1C1CCCC1
InChI Key InChIKey=VEIXNOODGDTSHF-UHFFFAOYSA-N
Data  3 IC50
  Tab Delimited (TSV)   2D SDfile   Computed 3D by Vconf -m prep SDfile
Find this compound or compounds like it in BindingDB:
Activity Spreadsheet -- Enzyme Inhibition Constant Data from BindingDB
Found 3 hits for monomerid = 41286
TargetCathepsin S(Homo sapiens (Human))
Pcmd
Curated by PubChem BioAssay
LigandPNGBDBM41286(1-[1-(1-Cyclopentyl-1H-tetrazol-5-yl)-2-methyl-pro...)
Affinity DataIC50: >5.00E+4nM. Assay description: Screening Center: Penn Center for Molecular Discovery Center Affiliation: University of Pennsylvania Network: Molecular Library Screening Center Netw...
Ligand InfoPC cidPC sid
In DepthDetails PCBioAssay
TargetMitochondrial import inner membrane translocase subunit TIM23(Saccharomyces cerevisiae S288c)
Burnham Center For Chemical Genomics
Curated by PubChem BioAssay
LigandPNGBDBM41286(1-[1-(1-Cyclopentyl-1H-tetrazol-5-yl)-2-methyl-pro...)
Affinity DataIC50:  1.37E+4nM. Assay description: Data Source: Sanford-Burnham Center for Chemical Genomics (SBCCG) Source Affiliation: Sanford-Burnham Medical Research Institute(SBMRI, San Diego, CA...
Ligand InfoPC cidPC sid
In DepthDetails PCBioAssay
TargetMitochondrial import inner membrane translocase subunit TIM10(Saccharomyces cerevisiae S288c)
Burnham Center For Chemical Genomics
Curated by PubChem BioAssay
LigandPNGBDBM41286(1-[1-(1-Cyclopentyl-1H-tetrazol-5-yl)-2-methyl-pro...)
Affinity DataIC50:  1.42E+4nM. Assay description: Data Source: Sanford-Burnham Center for Chemical Genomics (SBCCG) Source Affiliation: Sanford-Burnham Medical Research Institute(SBMRI, San Diego, CA...
Ligand InfoPC cidPC sid
In DepthDetails PCBioAssay