BDBM412911 US10399991, Example 28::US10822345, Ex 28
SMILES Cc1coc2c(C)c3[nH]c(=O)c(Br)c(-c4ccccc4C)c3cc12
InChI Key InChIKey=UIKMYHIDHQFVPP-UHFFFAOYSA-N
Data  2 IC50
  Tab Delimited (TSV)   2D SDfile   Computed 3D by Vconf -m prep SDfile
Find this compound or compounds like it in BindingDB:
Activity Spreadsheet -- Enzyme Inhibition Constant Data from BindingDB
Found 2 hits for monomerid = 412911
TargetPotassium voltage-gated channel subfamily A member 3(Homo sapiens (Human))
4Sc
US Patent
LigandPNGBDBM412911(US10399991, Example 28 | US10822345, Ex 28)
Affinity DataIC50:  1.00E+3nM. Assay description: For a description of a Kv1.3 patch-clamp assay, see Grissmer et al., Mol. Pharmacol. 1994, 45, 1227
Ligand Info
In DepthDetails US Patent
TargetPotassium voltage-gated channel subfamily A member 3(Homo sapiens (Human))
4Sc
US Patent
LigandPNGBDBM412911(US10399991, Example 28 | US10822345, Ex 28)
Affinity DataIC50:  1.00E+3nM. Assay description: For a description of a Kv1.3 patch-clamp assay, see Grissmer et al., Mol. Pharmacol. 1994, 45, 1227; whole cell patch-clamp recording was performed w...
Ligand Info
In DepthDetails US Patent