BDBM412933 US10399991, Example 50::US10822345, Ex 50
SMILES Cc1noc2c(C)c3oc(=O)cc(-c4ccccc4)c3cc12
InChI Key InChIKey=WQLCJEUEGDTLIW-UHFFFAOYSA-N
Data  2 IC50
  Tab Delimited (TSV)   2D SDfile   Computed 3D by Vconf -m prep SDfile
Find this compound or compounds like it in BindingDB:
Activity Spreadsheet -- Enzyme Inhibition Constant Data from BindingDB
Found 2 hits for monomerid = 412933
TargetPotassium voltage-gated channel subfamily A member 3(Homo sapiens (Human))
4Sc
US Patent
LigandPNGBDBM412933(US10399991, Example 50 | US10822345, Ex 50)
Affinity DataIC50:  2.25E+3nM. Assay description: For a description of a Kv1.3 patch-clamp assay, see Grissmer et al., Mol. Pharmacol. 1994, 45, 1227
Ligand Info
In DepthDetails US Patent
TargetPotassium voltage-gated channel subfamily A member 3(Homo sapiens (Human))
4Sc
US Patent
LigandPNGBDBM412933(US10399991, Example 50 | US10822345, Ex 50)
Affinity DataIC50:  2.25E+3nM. Assay description: For a description of a Kv1.3 patch-clamp assay, see Grissmer et al., Mol. Pharmacol. 1994, 45, 1227; whole cell patch-clamp recording was performed w...
Ligand Info
In DepthDetails US Patent