BDBM413063 4-(1-(5-(4-(2,2-difluoroethyl)piperazine-1-carbonyl)pyridin-2-yl)-5-hydroxy-1H-pyrazol-4-yl)-3-methylbenzonitrile::US10407409, Example 311
SMILES Cc1cc(ccc1-c1cnn(c1O)-c1ccc(cn1)C(=O)N1CCN(CC(F)F)CC1)C#N
InChI Key InChIKey=WPCDPGKXRVRPEG-UHFFFAOYSA-N
Data  1 IC50
  Tab Delimited (TSV)   2D SDfile   Computed 3D by Vconf -m prep SDfile
Find this compound or compounds like it in BindingDB:
Activity Spreadsheet -- Enzyme Inhibition Constant Data from BindingDB
Found 1 hit for monomerid = 413063
TargetEgl nine homolog 1 [181-417](Homo sapiens (Human))
Takeda Pharmaceutical
US Patent
LigandPNGBDBM413063(4-(1-(5-(4-(2,2-difluoroethyl)piperazine-1-carbony...)
Affinity DataIC50:  3.09nM. Assay description: The IC50 values for the PHD2 enzyme (residues 181-417) were determined by mixing increasing amounts of inhibitor with a fixed amount of enzyme (5 nM,...
Ligand Info
In DepthDetails US Patent