BDBM413210 (R)-4-(1-(5-(3-((2,2-difluoroethyl)(methyl)amino)piperidine-1-carbonyl)pyridin-2-yl)-5-hydroxy-1H-pyrazol-4-yl)-2-fluoro-3-methylbenzonitrile::US10407409, Example 336
SMILES CN(CC(F)F)[C@@H]1CCCN(C1)C(=O)c1ccc(nc1)-n1ncc(c1O)-c1ccc(C#N)c(F)c1C
InChI Key InChIKey=FFCJAPWTGBTUDH-GOSISDBHSA-N
Data  1 IC50
  Tab Delimited (TSV)   2D SDfile   Computed 3D by Vconf -m prep SDfile
Find this compound or compounds like it in BindingDB:
Activity Spreadsheet -- Enzyme Inhibition Constant Data from BindingDB
Found 1 hit for monomerid = 413210
TargetEgl nine homolog 1 [181-417](Homo sapiens (Human))
Takeda Pharmaceutical
US Patent
LigandPNGBDBM413210((R)-4-(1-(5-(3-((2,2-difluoroethyl)(methyl)amino)p...)
Affinity DataIC50:  2.95nM. Assay description: The IC50 values for the PHD2 enzyme (residues 181-417) were determined by mixing increasing amounts of inhibitor with a fixed amount of enzyme (5 nM,...
Ligand Info
In DepthDetails US Patent