BDBM413240 4-(1-(5-(4-cyclopropylpiperazine-1-carbonyl)pyridin-2-yl)-5-hydroxy-1H-pyrazol-4-yl)-3-methylbenzonitrile::US10407409, Example 414
SMILES Cc1cc(ccc1-c1cnn(c1O)-c1ccc(cn1)C(=O)N1CCN(CC1)C1CC1)C#N
InChI Key InChIKey=HTVYGHSENHGVDC-UHFFFAOYSA-N
Data  1 IC50
  Tab Delimited (TSV)   2D SDfile   Computed 3D by Vconf -m prep SDfile
Find this compound or compounds like it in BindingDB:
Activity Spreadsheet -- Enzyme Inhibition Constant Data from BindingDB
Found 1 hit for monomerid = 413240
TargetEgl nine homolog 1 [181-417](Homo sapiens (Human))
Takeda Pharmaceutical
US Patent
LigandPNGBDBM413240(4-(1-(5-(4-cyclopropylpiperazine-1-carbonyl)pyridi...)
Affinity DataIC50:  4.07nM. Assay description: The IC50 values for the PHD2 enzyme (residues 181-417) were determined by mixing increasing amounts of inhibitor with a fixed amount of enzyme (5 nM,...
Ligand Info
In DepthDetails US Patent