BDBM41335 2-[3-(4-fluorophenyl)-3-(2-furanyl)propyl]isoindole-1,3-dione::2-[3-(4-fluorophenyl)-3-(2-furyl)propyl]-1H-isoindole-1,3(2H)-dione::2-[3-(4-fluorophenyl)-3-(2-furyl)propyl]isoindoline-1,3-quinone::2-[3-(4-fluorophenyl)-3-(furan-2-yl)propyl]isoindole-1,3-dione::MLS000051076::SMR000078929::cid_2964469
SMILES Fc1ccc(cc1)C(CCN1C(=O)c2ccccc2C1=O)c1ccco1
InChI Key InChIKey=ZCUIAOVCAOGBLQ-UHFFFAOYSA-N
Data  1 IC50
  Tab Delimited (TSV)   2D SDfile   Computed 3D by Vconf -m prep SDfile
Find this compound or compounds like it in BindingDB:
Activity Spreadsheet -- Enzyme Inhibition Constant Data from BindingDB
Found 1 hit for monomerid = 41335
TargetCathepsin S(Homo sapiens (Human))
Pcmd
Curated by PubChem BioAssay
LigandPNGBDBM41335(2-[3-(4-fluorophenyl)-3-(2-furanyl)propyl]isoindol...)
Affinity DataIC50:  1.34E+4nM. Assay description: Screening Center: Penn Center for Molecular Discovery Center Affiliation: University of Pennsylvania Network: Molecular Library Screening Center Netw...
In DepthDetails PCBioAssay