BDBM413402 US10407423, Compound 2-09
SMILES COc1cc2c3N[C@@H](CC4CCN(C)CC4)CCc3c(nc2cc1OCCCN1CCCC1)-c1ccc(C)o1
InChI Key InChIKey=DUDXPIIRBFBCJJ-XMMPIXPASA-N
Data  2 IC50
  Tab Delimited (TSV)   2D SDfile   Computed 3D by Vconf -m prep SDfile
Find this compound or compounds like it in BindingDB:
Activity Spreadsheet -- Enzyme Inhibition Constant Data from BindingDB
Found 2 hits for monomerid = 413402
TargetDNA (cytosine-5)-methyltransferase 1(Homo sapiens (Human))
FundaciÓN Para La InvestigaciÓN MÉDica Aplicada
US Patent
LigandPNGBDBM413402(US10407423, Compound 2-09)
Affinity DataIC50:  750nM. Assay description: The biochemical assay to measure DNMT1 enzyme activity relies on time-resolved fluorescence energy transfer (TR-FRET) between lumi4-Tb (donor) and d2...
Ligand Info
In DepthDetails US Patent
TargetHistone-lysine N-methyltransferase EHMT2(Homo sapiens (Human))
FundaciÓN Para La InvestigaciÓN MÉDica Aplicada
US Patent
LigandPNGBDBM413402(US10407423, Compound 2-09)
Affinity DataIC50: <100nM. Assay description: The biochemical assay to measure G9a enzyme activity relies on time-resolved fluorescence energy transfer (TR-FRET) between europium cryptate (donor)...
Ligand Info
In DepthDetails US Patent