BDBM413465 O-[4-({2-[4-(5-Chloro-2-cyanophenyl)-5-methoxy-2-oxopyridin-1(2H)-yl]butanoyl}amino)-benzoyl]-N-(pyrrolidin-1-ylacetyl)-L-serine (Enantiomerically Pure Diastereomer)::US10414731, Example 5
SMILES CCC(C(=O)Nc1ccc(cc1)C(=O)OC[C@H](NC(=O)CN1CCCC1)C(O)=O)n1cc(OC)c(cc1=O)-c1cc(Cl)ccc1C#N
InChI Key InChIKey=JBZDNYYESRXQMG-QBHOUYDASA-N
Data  1 IC50
  Tab Delimited (TSV)   2D SDfile   Computed 3D by Vconf -m prep SDfile
Find this compound or compounds like it in BindingDB:
Activity Spreadsheet -- Enzyme Inhibition Constant Data from BindingDB
Found 1 hit for monomerid = 413465
TargetCoagulation factor XI(Homo sapiens (Human))
Bayer Pharma Aktiengesellschaft
US Patent
LigandPNGBDBM413465(O-[4-({2-[4-(5-Chloro-2-cyanophenyl)-5-methoxy-2-o...)
Affinity DataIC50:  60nM. Assay description: Test substances are dissolved in dimethyl sulphoxide and serially diluted in dimethyl sulphoxide (3000 μM to 0.0078 μM; resulting final con...
Ligand Info
In DepthDetails US Patent