BDBM413495 US10414734, Example 2-9::US10414734, Example 2-9-1
SMILES COc1cc2n([C@@H]3C[C@H](C)CC(C)(C)C3)c(Nc3ccc(OC(F)(F)F)cc3)nc2cc1CC(C)(C)O
InChI Key InChIKey=GTTQUIYOBKTHGV-FXAWDEMLSA-N
Data  2 IC50
  Tab Delimited (TSV)   2D SDfile   Computed 3D by Vconf -m prep SDfile
Find this compound or compounds like it in BindingDB:
Activity Spreadsheet -- Enzyme Inhibition Constant Data from BindingDB
Found 2 hits for monomerid = 413495
TargetIsocitrate dehydrogenase [NADP] cytoplasmic [R132H](Homo sapiens (Human))
Bayer Pharma Aktiengesellschaft
US Patent
LigandPNGBDBM413495(US10414734, Example 2-9 | US10414734, Example 2-9-...)
Affinity DataIC50:  30nM. Assay description: mIDH1 catalyzes the NADPH-dependent reduction of alpha-ketoglutarate (α-KG) to (2R)-2-hydroxyglutarate (2-HG). NADPH consumption was measured by...
Ligand Info
In DepthDetails US Patent
TargetIsocitrate dehydrogenase [NADP] cytoplasmic [R132H](Homo sapiens (Human))
Bayer Pharma Aktiengesellschaft
US Patent
LigandPNGBDBM413495(US10414734, Example 2-9 | US10414734, Example 2-9-...)
Affinity DataIC50:  20nM. Assay description: mIDH1 catalyzes the NADPH-dependent reduction of alpha-ketoglutarate (α-KG) to (2R)-2-hydroxyglutarate (2-HG). NADPH consumption was measured by...
Ligand Info
In DepthDetails US Patent