BDBM413514 US10414765, Example 17
SMILES COc1cccc(c1)C(=O)N1CC2CN(Cc3c(nc4ccccn34)-c3ccc(Cl)cc3)CC2C1
InChI Key InChIKey=JQQNQHGNKFGHED-UHFFFAOYSA-N
Data  4 IC50
  Tab Delimited (TSV)   2D SDfile   Computed 3D by Vconf -m prep SDfile
Find this compound or compounds like it in BindingDB:
Activity Spreadsheet -- Enzyme Inhibition Constant Data from BindingDB
Found 4 hits for monomerid = 413514
TargetPotassium channel subfamily K member 3(Homo sapiens (Human))
Bayer Pharma Aktiengesellschaft
US Patent
LigandPNGBDBM413514(US10414765, Example 17)
Affinity DataIC50:  9.30nM. Assay description: In Vitro Electrophysiological Analysis of the Human TASK-1 and TASK-3 Channels Via Two-Electrode Voltage Clamp Technique in Xenopus laevis OocytesSub...
Ligand Info
In DepthDetails US Patent
TargetPotassium channel subfamily K member 9(Homo sapiens (Human))
Bayer Pharma Aktiengesellschaft
US Patent
LigandPNGBDBM413514(US10414765, Example 17)
Affinity DataIC50:  1.90E+3nM. Assay description: In Vitro Electrophysiological Analysis of the Human TASK-1 and TASK-3 Channels Via Two-Electrode Voltage Clamp Technique in Xenopus laevis OocytesSub...
Ligand Info
In DepthDetails US Patent
TargetPotassium channel subfamily K member 3(Homo sapiens (Human))
Bayer Pharma Aktiengesellschaft
US Patent
LigandPNGBDBM413514(US10414765, Example 17)
Affinity DataIC50:  721nM. Assay description: In Vitro Electrophysiological Analysis of the Human TASK-1 and TASK-3 Channels Via Two-Electrode Voltage Clamp Technique in Xenopus laevis OocytesSub...
Ligand Info
In DepthDetails US Patent
TargetPotassium channel subfamily K member 9(Homo sapiens (Human))
Bayer Pharma Aktiengesellschaft
US Patent
LigandPNGBDBM413514(US10414765, Example 17)
Affinity DataIC50:  21.8nM. Assay description: In Vitro Electrophysiological Analysis of the Human TASK-1 and TASK-3 Channels Via Two-Electrode Voltage Clamp Technique in Xenopus laevis OocytesSub...
Ligand Info
In DepthDetails US Patent