BDBM413530 US10414765, Example 9
SMILES Brc1ccc(cc1)-c1nc2ccccn2c1CN1CC2CN(CC2C1)C(=O)C1CCC1
InChI Key InChIKey=CPDAXICXNQVSOR-UHFFFAOYSA-N
Data  2 IC50
  Tab Delimited (TSV)   2D SDfile   Computed 3D by Vconf -m prep SDfile
Find this compound or compounds like it in BindingDB:
Activity Spreadsheet -- Enzyme Inhibition Constant Data from BindingDB
Found 2 hits for monomerid = 413530
TargetPotassium channel subfamily K member 9(Homo sapiens (Human))
Bayer Pharma Aktiengesellschaft
US Patent
LigandPNGBDBM413530(US10414765, Example 9)
Affinity DataIC50:  660nM. Assay description: In Vitro Electrophysiological Analysis of the Human TASK-1 and TASK-3 Channels Via Two-Electrode Voltage Clamp Technique in Xenopus laevis OocytesSub...
Ligand Info
In DepthDetails US Patent
TargetPotassium channel subfamily K member 3(Homo sapiens (Human))
Bayer Pharma Aktiengesellschaft
US Patent
LigandPNGBDBM413530(US10414765, Example 9)
Affinity DataIC50:  749nM. Assay description: In Vitro Electrophysiological Analysis of the Human TASK-1 and TASK-3 Channels Via Two-Electrode Voltage Clamp Technique in Xenopus laevis OocytesSub...
Ligand Info
In DepthDetails US Patent