BDBM413542 US10414765, Example 23
SMILES FC(F)(F)c1cccc(c1)C(=O)N1CC2CN(Cc3c(nc4ccccn34)-c3ccc(Cl)cc3)CC2C1
InChI Key InChIKey=SXSQCUOBYKHYMX-UHFFFAOYSA-N
Data  2 IC50
  Tab Delimited (TSV)   2D SDfile   Computed 3D by Vconf -m prep SDfile
Find this compound or compounds like it in BindingDB:
Activity Spreadsheet -- Enzyme Inhibition Constant Data from BindingDB
Found 2 hits for monomerid = 413542
TargetPotassium channel subfamily K member 9(Homo sapiens (Human))
Bayer Pharma Aktiengesellschaft
US Patent
LigandPNGBDBM413542(US10414765, Example 23)
Affinity DataIC50:  100nM. Assay description: In Vitro Electrophysiological Analysis of the Human TASK-1 and TASK-3 Channels Via Two-Electrode Voltage Clamp Technique in Xenopus laevis OocytesSub...
Ligand Info
In DepthDetails US Patent
TargetPotassium channel subfamily K member 3(Homo sapiens (Human))
Bayer Pharma Aktiengesellschaft
US Patent
LigandPNGBDBM413542(US10414765, Example 23)
Affinity DataIC50:  728nM. Assay description: In Vitro Electrophysiological Analysis of the Human TASK-1 and TASK-3 Channels Via Two-Electrode Voltage Clamp Technique in Xenopus laevis OocytesSub...
Ligand Info
In DepthDetails US Patent