BDBM413569 (2S)-1-acetyl-N-[(1S)-1-[[(1S)-3-[(3,5-difluorobenzoyl)amino]-1-(hydroxycarbamoyl)propyl]carbamoyl]-2-methyl-butyl]-N-methyl-pyrrolidine-2-carboxamide::US10414797, Example 2
SMILES CCC(C)[C@H](N(C)C(=O)[C@@H]1CCCN1C(C)=O)C(=O)N[C@@H](CCNC(=O)c1cc(F)cc(F)c1)C(=O)NO
InChI Key InChIKey=BZAZPTCEVDUXHR-JOYGSARASA-N
Data  5 IC50
  Tab Delimited (TSV)   2D SDfile   Computed 3D by Vconf -m prep SDfile
Find this compound or compounds like it in BindingDB:
Activity Spreadsheet -- Enzyme Inhibition Constant Data from BindingDB
Found 5 hits for monomerid = 413569
TargetMetalloproteinase inhibitor 2(Cricetulus longicaudatus (Long-tailed dwarf hamste...)
Iproteos
US Patent
LigandPNGBDBM413569((2S)-1-acetyl-N-[(1S)-1-[[(1S)-3-[(3,5-difluoroben...)
Affinity DataIC50:  242nM. Assay description: MMP-2: Recombinant MMP-2 expressed in Chinese hamster ovary (CHO) cells was obtained from Merck-Millipore (catalog number PF023-5UG). DQ gelatin from...
Ligand Info
In DepthDetails US Patent
TargetMatrix metalloproteinase-9(Homo sapiens (Human))
Iproteos
US Patent
LigandPNGBDBM413569((2S)-1-acetyl-N-[(1S)-1-[[(1S)-3-[(3,5-difluoroben...)
Affinity DataIC50:  301nM. Assay description: MMP-9: Recombinant MMP-9 expressed was obtained from Merck-Millipore (catalog number PF140-5UG, used in examples 1 to 9 and comparative examples) and...
Ligand Info
In DepthDetails US Patent
TargetMatrilysin(Homo sapiens (Human))
Iproteos
US Patent
LigandPNGBDBM413569((2S)-1-acetyl-N-[(1S)-1-[[(1S)-3-[(3,5-difluoroben...)
Affinity DataIC50:  3.14E+7nM. Assay description: MMP-7: Recombinant MMP-7 expressed in E. Coli was obtained from Merck-Millipore (catalog number 44270). Mca-PLGL-Dpa-AR-NH2 (fluorogenic peptide subs...
Ligand Info
In DepthDetails US Patent
TargetStromelysin-1(Homo sapiens (Human))
Iproteos
US Patent
LigandPNGBDBM413569((2S)-1-acetyl-N-[(1S)-1-[[(1S)-3-[(3,5-difluoroben...)
Affinity DataIC50:  1.92E+7nM. Assay description: MMP-3: Preparation of the MMP-3 for the activity assay: MMP-3 was provided as a stock solution (0.1 mg/mL). The enzyme was diluted in water to a fina...
Ligand Info
In DepthDetails US Patent
TargetInterstitial collagenase(Homo sapiens (Human))
Iproteos
US Patent
LigandPNGBDBM413569((2S)-1-acetyl-N-[(1S)-1-[[(1S)-3-[(3,5-difluoroben...)
Affinity DataIC50:  4.94E+6nM. Assay description: MMP-1:MMP-1 peptide substrate was provided as a stock solution in DMSO (6 mM). For the assay, the substrate was diluted 1× reaction buffer to a conce...
Ligand Info
In DepthDetails US Patent