BDBM413597 US10421722, Compound 6a
SMILES CNS(=O)(=O)c1ccc(cc1)C(=O)C1CCN(CC1)[C@@H]1Cc2ccccc2C[C@H]1O
InChI Key InChIKey=HPCZKIYDDYRCLJ-FGZHOGPDSA-N
Data  1 KI
  Tab Delimited (TSV)   2D SDfile   Computed 3D by Vconf -m prep SDfile
Find this compound or compounds like it in BindingDB:
Activity Spreadsheet -- Enzyme Inhibition Constant Data from BindingDB
Found 1 hit for monomerid = 413597
TargetVesicular acetylcholine transporter(Homo sapiens (Human))
Washington University
US Patent
LigandPNGBDBM413597(US10421722, Compound 6a)
Affinity DataKi:  6.30nM. Assay description: The binding affinity of a compound to VAChT was measured by competition against the binding of 5 nM [3H]Vesamicol to postnuclear supernatant prepared...
Ligand InfoPC cidPC sid
In DepthDetails US Patent