BDBM41360 MLS000118109::N-[2-(dipropylamino)ethyl]-1,5-dimethyl-4-oxidanylidene-pyrrolo[3,2-c]quinoline-2-carboxamide::N-[2-(dipropylamino)ethyl]-1,5-dimethyl-4-oxo-2-pyrrolo[3,2-c]quinolinecarboxamide::N-[2-(dipropylamino)ethyl]-1,5-dimethyl-4-oxopyrrolo[3,2-c]quinoline-2-carboxamide::N-[2-(dipropylamino)ethyl]-4-keto-1,5-dimethyl-pyrrolo[3,2-c]quinoline-2-carboxamide::SMR000095057::cid_5307613
SMILES CCCN(CCC)CCNC(=O)c1cc2c(n1C)c1ccccc1n(C)c2=O
InChI Key InChIKey=FHVWFSSNSXOXNC-UHFFFAOYSA-N
Data  3 IC50
  Tab Delimited (TSV)   2D SDfile   Computed 3D by Vconf -m prep SDfile
Find this compound or compounds like it in BindingDB:
Activity Spreadsheet -- Enzyme Inhibition Constant Data from BindingDB
Found 3 hits for monomerid = 41360
TargetCathepsin S(Homo sapiens (Human))
Pcmd
Curated by PubChem BioAssay
LigandPNGBDBM41360(MLS000118109 | N-[2-(dipropylamino)ethyl]-1,5-dime...)
Affinity DataIC50:  1.95E+3nM. Assay description: Screening Center: Penn Center for Molecular Discovery Center Affiliation: University of Pennsylvania Network: Molecular Library Screening Center Netw...
In DepthDetails PCBioAssay
TargetProtein Wnt-3a(Mus musculus)
Burnham Center For Chemical Genomics
Curated by PubChem BioAssay
LigandPNGBDBM41360(MLS000118109 | N-[2-(dipropylamino)ethyl]-1,5-dime...)
Affinity DataIC50: >5.00E+4nM
In DepthDetails PCBioAssay
TargetZinc finger protein GLI1(Mus musculus)
Burnham Center For Chemical Genomics
Curated by PubChem BioAssay
LigandPNGBDBM41360(MLS000118109 | N-[2-(dipropylamino)ethyl]-1,5-dime...)
Affinity DataIC50: >2.00E+4nM. Assay description: Data Source: Sanford-Burnham Center for Chemical Genomics (SBCCG) Source Affiliation: Sanford-Burnham Medical Research Institute (SBMRI, San Diego, C...
In DepthDetails PCBioAssay