BDBM413600 US10421722, Compound 9a
SMILES O[C@@H]1Cc2ccccc2C[C@H]1N1CCC(CC1)C(=O)c1ccc(SCCF)cc1
InChI Key InChIKey=WUMIOFQMUIRHIN-DHIUTWEWSA-N
Data  1 KI
  Tab Delimited (TSV)   2D SDfile   Computed 3D by Vconf -m prep SDfile
Find this compound or compounds like it in BindingDB:
Activity Spreadsheet -- Enzyme Inhibition Constant Data from BindingDB
Found 1 hit for monomerid = 413600
TargetVesicular acetylcholine transporter(Homo sapiens (Human))
Washington University
US Patent
LigandPNGBDBM413600(US10421722, Compound 9a)
Affinity DataKi:  2.40nM. Assay description: The binding affinity of a compound to VAChT was measured by competition against the binding of 5 nM [3H]Vesamicol to postnuclear supernatant prepared...
Ligand InfoPC cidPC sid
In DepthDetails US Patent