BDBM413720 4-{[2-{4-[5-Chloro-2-(1H-tetrazol-1-yl)phenyl]-5-methoxy-2-oxopyridin-1(2H)-yl}pentanoyl]amino}-2-fluorobenzamide (Racemate)::US10421742, Example 113::US11180471, Example 113
SMILES CCCC(C(=O)Nc1ccc(C(N)=O)c(F)c1)n1cc(OC)c(cc1=O)-c1cc(Cl)ccc1-n1cnnn1
InChI Key InChIKey=CZWHJSKWMSOPRC-UHFFFAOYSA-N
Data  4 IC50
  Tab Delimited (TSV)   2D SDfile   Computed 3D by Vconf -m prep SDfile
Find this compound or compounds like it in BindingDB:
Activity Spreadsheet -- Enzyme Inhibition Constant Data from BindingDB
Found 4 hits for monomerid = 413720
TargetCoagulation factor XI(Homo sapiens (Human))
Bayer Pharma Aktiengesellschaft
US Patent
LigandPNGBDBM413720(4-{[2-{4-[5-Chloro-2-(1H-tetrazol-1-yl)phenyl]-5-m...)
Affinity DataIC50:  0.550nM. Assay description: The factor XIa inhibition of the substances according to the invention is determined using a biochemical test system which utilizes the reaction of a...
Ligand InfoPC cidPC sid
In DepthDetails US Patent
TargetPlasma kallikrein(Homo sapiens (Human))
Bayer Pharma Aktiengesellschaft
US Patent
LigandPNGBDBM413720(4-{[2-{4-[5-Chloro-2-(1H-tetrazol-1-yl)phenyl]-5-m...)
Affinity DataIC50:  3.70nM. Assay description: Plasma Kallikrein: Test substances are dissolved in dimethyl sulphoxide and serially diluted in dimethyl sulphoxide (3000 μM to 0.0078 μM; ...
Ligand InfoPC cidPC sid
In DepthDetails US Patent
TargetCoagulation factor XI(Homo sapiens (Human))
Bayer Pharma Aktiengesellschaft
US Patent
LigandPNGBDBM413720(4-{[2-{4-[5-Chloro-2-(1H-tetrazol-1-yl)phenyl]-5-m...)
Affinity DataIC50:  0.550nM. Assay description: FXIa: Test substances are dissolved in dimethyl sulphoxide and serially diluted in dimethyl sulphoxide (3000 μM to 0.0078 μM; resulting fin...
Ligand InfoPC cidPC sid
In DepthDetails US Patent
TargetPlasma kallikrein(Homo sapiens (Human))
Bayer Pharma Aktiengesellschaft
US Patent
LigandPNGBDBM413720(4-{[2-{4-[5-Chloro-2-(1H-tetrazol-1-yl)phenyl]-5-m...)
Affinity DataIC50:  3.70nM. Assay description: To determine the plasma kallikrein inhibition of the substances according to the invention, a biochemical test system is used which utilizes the reac...
Ligand InfoPC cidPC sid
In DepthDetails US Patent