BDBM413775 (2S)-2-{4-[5-Chloro-2-(4-chloro-1H-1,2,3-triazol-1-yl)phenyl]-5-methoxy-2-oxopyridin-1(2H)-yl}-N-(2-methyl-2H-indazol-5-yl)butanamide (Enantiomer 2)::US10421742, Example 168
SMILES CC[C@@H](C(=O)Nc1ccc2nn(C)cc2c1)n1cc(OC)c(cc1=O)-c1cc(Cl)ccc1-n1cc(Cl)nn1
InChI Key InChIKey=QBWXHIMIUSZAOP-NRFANRHFSA-N
Data  2 IC50
  Tab Delimited (TSV)   2D SDfile   Computed 3D by Vconf -m prep SDfile
Find this compound or compounds like it in BindingDB:
Activity Spreadsheet -- Enzyme Inhibition Constant Data from BindingDB
Found 2 hits for monomerid = 413775
TargetPlasma kallikrein(Homo sapiens (Human))
Bayer Pharma Aktiengesellschaft
US Patent
LigandPNGBDBM413775((2S)-2-{4-[5-Chloro-2-(4-chloro-1H-1,2,3-triazol-1...)
Affinity DataIC50:  2.10nM. Assay description: To determine the plasma kallikrein inhibition of the substances according to the invention, a biochemical test system is used which utilizes the reac...
Ligand InfoPC cidPC sid
In DepthDetails US Patent
TargetCoagulation factor XI(Homo sapiens (Human))
Bayer Pharma Aktiengesellschaft
US Patent
LigandPNGBDBM413775((2S)-2-{4-[5-Chloro-2-(4-chloro-1H-1,2,3-triazol-1...)
Affinity DataIC50:  0.780nM. Assay description: The factor XIa inhibition of the substances according to the invention is determined using a biochemical test system which utilizes the reaction of a...
Ligand InfoPC cidPC sid
In DepthDetails US Patent