BDBM413817 (2S)-2-[4-{5-Chloro-2-[4-(difluoromethyl)-1H-1,2,3-triazol-1-yl]phenyl}-5-methoxy-2-oxopyridin-1(2H)-yl]-N-[2-(difluoromethyl)-2H-indazol-5-yl]butanamide (Enantiomer 2)::US10421742, Example 210::US11180471, Example 210
SMILES CC[C@@H](C(=O)Nc1ccc2nn(cc2c1)C(F)F)n1cc(OC)c(cc1=O)-c1cc(Cl)ccc1-n1cc(nn1)C(F)F
InChI Key InChIKey=METWKYXLYOAEDA-NRFANRHFSA-N
Data  4 IC50
  Tab Delimited (TSV)   2D SDfile   Computed 3D by Vconf -m prep SDfile
Find this compound or compounds like it in BindingDB:
Activity Spreadsheet -- Enzyme Inhibition Constant Data from BindingDB
Found 4 hits for monomerid = 413817
TargetCoagulation factor XI(Homo sapiens (Human))
Bayer Pharma Aktiengesellschaft
US Patent
LigandPNGBDBM413817((2S)-2-[4-{5-Chloro-2-[4-(difluoromethyl)-1H-1,2,3...)
Affinity DataIC50:  0.780nM. Assay description: The factor XIa inhibition of the substances according to the invention is determined using a biochemical test system which utilizes the reaction of a...
Ligand InfoPC cidPC sid
In DepthDetails US Patent
TargetPlasma kallikrein(Homo sapiens (Human))
Bayer Pharma Aktiengesellschaft
US Patent
LigandPNGBDBM413817((2S)-2-[4-{5-Chloro-2-[4-(difluoromethyl)-1H-1,2,3...)
Affinity DataIC50:  3.5nM. Assay description: Plasma Kallikrein: Test substances are dissolved in dimethyl sulphoxide and serially diluted in dimethyl sulphoxide (3000 μM to 0.0078 μM; ...
Ligand InfoPC cidPC sid
In DepthDetails US Patent
TargetCoagulation factor XI(Homo sapiens (Human))
Bayer Pharma Aktiengesellschaft
US Patent
LigandPNGBDBM413817((2S)-2-[4-{5-Chloro-2-[4-(difluoromethyl)-1H-1,2,3...)
Affinity DataIC50:  0.780nM. Assay description: FXIa: Test substances are dissolved in dimethyl sulphoxide and serially diluted in dimethyl sulphoxide (3000 μM to 0.0078 μM; resulting fin...
Ligand InfoPC cidPC sid
In DepthDetails US Patent
TargetPlasma kallikrein(Homo sapiens (Human))
Bayer Pharma Aktiengesellschaft
US Patent
LigandPNGBDBM413817((2S)-2-[4-{5-Chloro-2-[4-(difluoromethyl)-1H-1,2,3...)
Affinity DataIC50:  3.5nM. Assay description: To determine the plasma kallikrein inhibition of the substances according to the invention, a biochemical test system is used which utilizes the reac...
Ligand InfoPC cidPC sid
In DepthDetails US Patent