BDBM413871 5-(1-benzylpiperidin-4-yl)-7-(4- methoxybenzyl)-4-oxa-7- azaspiro[2.5]octan-8-one::US10421750, Example 3
SMILES COc1ccc(CN2CC(OC3(CC3)C2=O)C2CCN(Cc3ccccc3)CC2)cc1
InChI Key InChIKey=JWDSBOKEBGRCRE-UHFFFAOYSA-N
Data  1 KI
  Tab Delimited (TSV)   2D SDfile   Computed 3D by Vconf -m prep SDfile
Find this compound or compounds like it in BindingDB:
Activity Spreadsheet -- Enzyme Inhibition Constant Data from BindingDB
Found 1 hit for monomerid = 413871
TargetSigma non-opioid intracellular receptor 1(Homo sapiens (Human))
Esteve Pharmaceuticals
US Patent
LigandPNGBDBM413871(5-(1-benzylpiperidin-4-yl)-7-(4- methoxybenzyl)-4-...)
Affinity DataKi: <500nM. Assay description: To investigate binding properties of test compounds to human σ1 receptor, transfected HEK-293 membranes and [3H](+)-pentazocine (Perkin Elmer, N...
Ligand InfoPC cidPC sid
In DepthDetails US Patent