BDBM413882 5-(1-benzylpiperidin-4-yl)-7-ethyl-4- oxa-7-azaspiro[2.5]octane::US10421750, Example 14
SMILES CCN1CC(OC2(CC2)C1)C1CCN(Cc2ccccc2)CC1
InChI Key InChIKey=JYDIMCXCONPBLV-UHFFFAOYSA-N
Data  1 KI
  Tab Delimited (TSV)   2D SDfile   Computed 3D by Vconf -m prep SDfile
Find this compound or compounds like it in BindingDB:
Activity Spreadsheet -- Enzyme Inhibition Constant Data from BindingDB
Found 1 hit for monomerid = 413882
TargetSigma non-opioid intracellular receptor 1(Homo sapiens (Human))
Esteve Pharmaceuticals
US Patent
LigandPNGBDBM413882(5-(1-benzylpiperidin-4-yl)-7-ethyl-4- oxa-7-azaspi...)
Affinity DataKi: <100nM. Assay description: To investigate binding properties of test compounds to human σ1 receptor, transfected HEK-293 membranes and [3H](+)-pentazocine (Perkin Elmer, N...
Ligand InfoPC cidPC sid
In DepthDetails US Patent