BDBM413897 4-((4-((2R,6R)-4-ethyl-6-methyl-5- oxomorpholin-2-yl)piperidin-1- yl)methyl)benzonitrile::US10421750, Example 33
SMILES CCN1C[C@H](O[C@H](C)C1=O)C1CCN(Cc2ccc(cc2)C#N)CC1
InChI Key InChIKey=FCWDXQYNNBSWHW-BEFAXECRSA-N
Data  1 KI
  Tab Delimited (TSV)   2D SDfile   Computed 3D by Vconf -m prep SDfile
Find this compound or compounds like it in BindingDB:
Activity Spreadsheet -- Enzyme Inhibition Constant Data from BindingDB
Found 1 hit for monomerid = 413897
TargetSigma non-opioid intracellular receptor 1(Homo sapiens (Human))
Esteve Pharmaceuticals
US Patent
LigandPNGBDBM413897(4-((4-((2R,6R)-4-ethyl-6-methyl-5- oxomorpholin-2-...)
Affinity DataKi: >500nM. Assay description: To investigate binding properties of test compounds to human σ1 receptor, transfected HEK-293 membranes and [3H](+)-pentazocine (Perkin Elmer, N...
Ligand InfoPC cidPC sid
In DepthDetails US Patent