BDBM413905 6-(1-benzylpiperidin-4-yl)-4- ethylmorpholin-3-one::US10421750, Example 41
SMILES CCN1CC(OCC1=O)C1CCN(Cc2ccccc2)CC1
InChI Key InChIKey=SFINQBUJIMKKQY-UHFFFAOYSA-N
Data  1 KI
  Tab Delimited (TSV)   2D SDfile   Computed 3D by Vconf -m prep SDfile
Find this compound or compounds like it in BindingDB:
Activity Spreadsheet -- Enzyme Inhibition Constant Data from BindingDB
Found 1 hit for monomerid = 413905
TargetSigma non-opioid intracellular receptor 1(Homo sapiens (Human))
Esteve Pharmaceuticals
US Patent
LigandPNGBDBM413905(6-(1-benzylpiperidin-4-yl)-4- ethylmorpholin-3-one...)
Affinity DataKi: <100nM. Assay description: To investigate binding properties of test compounds to human σ1 receptor, transfected HEK-293 membranes and [3H](+)-pentazocine (Perkin Elmer, N...
Ligand InfoPC cidPC sid
In DepthDetails US Patent