BDBM413923 US10421756, Compound 107::US10421756, Compound 109
SMILES CC(=O)N1C2CCC1CN(C2)C(=O)Nc1cc(ccc1N)-c1ccncc1
InChI Key InChIKey=JWGBSSQLBRLGBQ-UHFFFAOYSA-N
Data  4 Kd
  Tab Delimited (TSV)   2D SDfile   Computed 3D by Vconf -m prep SDfile
Find this compound or compounds like it in BindingDB:
Activity Spreadsheet -- Enzyme Inhibition Constant Data from BindingDB
Found 4 hits for monomerid = 413923
TargetHistone deacetylase 2(Homo sapiens (Human))
Rodin Therapeutics
US Patent
LigandPNGBDBM413923(US10421756, Compound 107 | US10421756, Compound 10...)
Affinity DataKd: >5.00E+3nM. Assay description: HDAC2 containing a C-terminal HIS-Tag (Proteros) and fluorescently-labeled anti-HIS-antibody are diluted in one vial in assay buffer 50 mM Tris, pH 8...
Ligand InfoPC cidPC sid
In DepthDetails US Patent
TargetHistone deacetylase 1(Homo sapiens (Human))
Rodin Therapeutics
US Patent
LigandPNGBDBM413923(US10421756, Compound 107 | US10421756, Compound 10...)
Affinity DataKd: >5.00E+3nM. Assay description: HDAC2 containing a C-terminal HIS-Tag (Proteros) and fluorescently-labeled anti-HIS-antibody are diluted in one vial in assay buffer 50 mM Tris, pH 8...
Ligand InfoPC cidPC sid
In DepthDetails US Patent
TargetHistone deacetylase 2(Homo sapiens (Human))
Rodin Therapeutics
US Patent
LigandPNGBDBM413923(US10421756, Compound 107 | US10421756, Compound 10...)
Affinity DataKd: >5.00E+3nM. Assay description: HDAC2 containing a C-terminal HIS-Tag (Proteros) and fluorescently-labeled anti-HIS-antibody are diluted in one vial in assay buffer 50 mM Tris, pH 8...
Ligand InfoPC cidPC sid
In DepthDetails US Patent
TargetHistone deacetylase 1(Homo sapiens (Human))
Rodin Therapeutics
US Patent
LigandPNGBDBM413923(US10421756, Compound 107 | US10421756, Compound 10...)
Affinity DataKd: >5.00E+3nM. Assay description: HDAC2 containing a C-terminal HIS-Tag (Proteros) and fluorescently-labeled anti-HIS-antibody are diluted in one vial in assay buffer 50 mM Tris, pH 8...
Ligand InfoPC cidPC sid
In DepthDetails US Patent