BDBM413924 US10421756, Compound 108
SMILES CC(=O)N1CC2CC1CN2C(=O)Nc1cc(ccc1N)-c1ccncc1
InChI Key InChIKey=OZFMKPOOEJEDOP-UHFFFAOYSA-N
Data  2 Kd
  Tab Delimited (TSV)   2D SDfile   Computed 3D by Vconf -m prep SDfile
Find this compound or compounds like it in BindingDB:
Activity Spreadsheet -- Enzyme Inhibition Constant Data from BindingDB
Found 2 hits for monomerid = 413924
TargetHistone deacetylase 1(Homo sapiens (Human))
Rodin Therapeutics
US Patent
LigandPNGBDBM413924(US10421756, Compound 108)
Affinity DataKd: >5.00E+3nM. Assay description: HDAC2 containing a C-terminal HIS-Tag (Proteros) and fluorescently-labeled anti-HIS-antibody are diluted in one vial in assay buffer 50 mM Tris, pH 8...
Ligand InfoPC cidPC sid
In DepthDetails US Patent
TargetHistone deacetylase 2(Homo sapiens (Human))
Rodin Therapeutics
US Patent
LigandPNGBDBM413924(US10421756, Compound 108)
Affinity DataKd: >5.00E+3nM. Assay description: HDAC2 containing a C-terminal HIS-Tag (Proteros) and fluorescently-labeled anti-HIS-antibody are diluted in one vial in assay buffer 50 mM Tris, pH 8...
Ligand InfoPC cidPC sid
In DepthDetails US Patent