BDBM413939 US10421756, Compound 123
SMILES Nc1ccc(cc1NC(=O)c1cn2CCNCc2n1)-c1ccncc1
InChI Key InChIKey=QGXJNNSZUYYIGK-UHFFFAOYSA-N
Data  2 Kd
  Tab Delimited (TSV)   2D SDfile   Computed 3D by Vconf -m prep SDfile
Find this compound or compounds like it in BindingDB:
Activity Spreadsheet -- Enzyme Inhibition Constant Data from BindingDB
Found 2 hits for monomerid = 413939
TargetHistone deacetylase 1(Homo sapiens (Human))
Rodin Therapeutics
US Patent
LigandPNGBDBM413939(US10421756, Compound 123)
Affinity DataKd:  300nM. Assay description: HDAC2 containing a C-terminal HIS-Tag (Proteros) and fluorescently-labeled anti-HIS-antibody are diluted in one vial in assay buffer 50 mM Tris, pH 8...
Ligand InfoPC cidPC sid
In DepthDetails US Patent
TargetHistone deacetylase 2(Homo sapiens (Human))
Rodin Therapeutics
US Patent
LigandPNGBDBM413939(US10421756, Compound 123)
Affinity DataKd:  300nM. Assay description: HDAC2 containing a C-terminal HIS-Tag (Proteros) and fluorescently-labeled anti-HIS-antibody are diluted in one vial in assay buffer 50 mM Tris, pH 8...
Ligand InfoPC cidPC sid
In DepthDetails US Patent