BDBM413985 US10421756, Compound 169
SMILES Nc1ccc(cc1NC(=O)N1CC2(C1)CCNCC2)-c1ccc(F)cc1
InChI Key InChIKey=YOIYJKLPBYTPKG-UHFFFAOYSA-N
Data  2 Kd
  Tab Delimited (TSV)   2D SDfile   Computed 3D by Vconf -m prep SDfile
Find this compound or compounds like it in BindingDB:
Activity Spreadsheet -- Enzyme Inhibition Constant Data from BindingDB
Found 2 hits for monomerid = 413985
TargetHistone deacetylase 1(Homo sapiens (Human))
Rodin Therapeutics
US Patent
LigandPNGBDBM413985(US10421756, Compound 169)
Affinity DataKd:  2.75E+3nM. Assay description: HDAC2 containing a C-terminal HIS-Tag (Proteros) and fluorescently-labeled anti-HIS-antibody are diluted in one vial in assay buffer 50 mM Tris, pH 8...
Ligand InfoPC cidPC sid
In DepthDetails US Patent
TargetHistone deacetylase 2(Homo sapiens (Human))
Rodin Therapeutics
US Patent
LigandPNGBDBM413985(US10421756, Compound 169)
Affinity DataKd:  2.75E+3nM. Assay description: HDAC2 containing a C-terminal HIS-Tag (Proteros) and fluorescently-labeled anti-HIS-antibody are diluted in one vial in assay buffer 50 mM Tris, pH 8...
Ligand InfoPC cidPC sid
In DepthDetails US Patent