BDBM41403 MLS000087436::N-(2-furanylmethyl)-7-methoxy-4,5-dihydrobenzo[g][1,2]benzoxazole-3-carboxamide::N-(2-furfuryl)-7-methoxy-4,5-dihydrobenz[g]indoxazene-3-carboxamide::N-(2-furylmethyl)-7-methoxy-4,5-dihydronaphtho[2,1-d]isoxazole-3-carboxamide::N-(furan-2-ylmethyl)-7-methoxy-4,5-dihydrobenzo[g][1,2]benzoxazole-3-carboxamide::SMR000023659::cid_3240952
SMILES COc1ccc2-c3onc(C(=O)NCc4ccco4)c3CCc2c1
InChI Key InChIKey=GRMKQVYZGOURPI-UHFFFAOYSA-N
Data  1 IC50
  Tab Delimited (TSV)   2D SDfile   Computed 3D by Vconf -m prep SDfile
Find this compound or compounds like it in BindingDB:
Activity Spreadsheet -- Enzyme Inhibition Constant Data from BindingDB
Found 1 hit for monomerid = 41403
TargetCathepsin G(Homo sapiens (Human))
Pcmd
Curated by PubChem BioAssay
LigandPNGBDBM41403(MLS000087436 | N-(2-furanylmethyl)-7-methoxy-4,5-d...)
Affinity DataIC50:  1.58E+3nM. Assay description: Screening Center: Penn Center for Molecular Discovery Center Affiliation: University of Pennsylvania Network: Molecular Library Screening Center Netw...
In DepthDetails PCBioAssay