BDBM41407 5-(3-methoxyphenyl)-N-(2-phenylethyl)-1,2-oxazole-3-carboxamide::5-(3-methoxyphenyl)-N-(2-phenylethyl)-3-isoxazolecarboxamide::5-(3-methoxyphenyl)-N-(2-phenylethyl)isoxazole-3-carboxamide::5-(3-methoxyphenyl)-N-phenethyl-isoxazole-3-carboxamide::MLS000087062::SMR000023285::cid_3243612
SMILES COc1cccc(c1)-c1cc(no1)C(=O)NCCc1ccccc1
InChI Key InChIKey=CQTSDBSXPZOOKM-UHFFFAOYSA-N
Data  1 IC50
  Tab Delimited (TSV)   2D SDfile   Computed 3D by Vconf -m prep SDfile
Find this compound or compounds like it in BindingDB:
Activity Spreadsheet -- Enzyme Inhibition Constant Data from BindingDB
Found 1 hit for monomerid = 41407
TargetCathepsin G(Homo sapiens (Human))
Pcmd
Curated by PubChem BioAssay
LigandPNGBDBM41407(5-(3-methoxyphenyl)-N-(2-phenylethyl)-1,2-oxazole-...)
Affinity DataIC50: >5.00E+4nM. Assay description: Screening Center: Penn Center for Molecular Discovery Center Affiliation: University of Pennsylvania Network: Molecular Library Screening Center Netw...
In DepthDetails PCBioAssay