BDBM414424 N-[2-(1-Glycoloylpiperidin-4-yl)-6-methoxy-2H-indazol-5-yl]-6-(trifluoromethyl)pyridine-2-carboxamide::US10435396, Example 5
SMILES COc1cc2nn(cc2cc1NC(=O)c1cccc(n1)C(F)(F)F)C1CCN(CC1)C(=O)CO
InChI Key InChIKey=GIEFYDDOCUUGGJ-UHFFFAOYSA-N
Data  1 IC50
  Tab Delimited (TSV)   2D SDfile   Computed 3D by Vconf -m prep SDfile
Find this compound or compounds like it in BindingDB:
Activity Spreadsheet -- Enzyme Inhibition Constant Data from BindingDB
Found 1 hit for monomerid = 414424
TargetInterleukin-1 receptor-associated kinase 4(Homo sapiens (Human))
Bayer Pharma Aktiegesellschaft
US Patent
LigandPNGBDBM414424(N-[2-(1-Glycoloylpiperidin-4-yl)-6-methoxy-2H-inda...)
Affinity DataIC50:  2nM. Assay description: For the assay, 11 different concentrations in the range from 20 μM to 0.073 nM were prepared from a 2 mM solution of the test substance in DMSO....
Ligand InfoPC cidPC sid
In DepthDetails US Patent