BDBM414451 N-(4-bromophenyl)-2-(4-cyclopropyl- 4-methyl-2,5-dioxoimidazolidin-1- yl)acetamide::US10434112, Table 3.7
SMILES CC1(NC(=O)N(NC(=O)Nc2ccc(Br)cc2)C1=O)C1CC1
InChI Key InChIKey=OJIUURQPRFFQEC-UHFFFAOYSA-N
Data  1 EC50
  Tab Delimited (TSV)   2D SDfile   Computed 3D by Vconf -m prep SDfile
Find this compound or compounds like it in BindingDB:
Activity Spreadsheet -- Enzyme Inhibition Constant Data from BindingDB
Found 1 hit for monomerid = 414451
TargetN-formyl peptide receptor 2(Homo sapiens (Human))
Allergan
US Patent
LigandPNGBDBM414451(N-(4-bromophenyl)-2-(4-cyclopropyl- 4-methyl-2,5-d...)
Affinity DataEC50:  166nM. Assay description: HEK-Gα16 cells stably expressing the human FPR2 receptor was utilized. Cells were plated into 384-well poly-D-lysine coated plates at a density ...
Ligand InfoPC cidPC sid
In DepthDetails US Patent