BDBM414453 N-(4-bromophenyl)-2-(4-ethyl-4- methyl-2,5-dioxoimidazolidin-1- yl)acetamide::US10434112, Table 3.9
SMILES CCC1(C)NC(=O)N(NC(=O)Nc2ccc(Br)cc2)C1=O
InChI Key InChIKey=YKIHQPBZNREHEL-UHFFFAOYSA-N
Data  1 EC50
  Tab Delimited (TSV)   2D SDfile   Computed 3D by Vconf -m prep SDfile
Find this compound or compounds like it in BindingDB:
Activity Spreadsheet -- Enzyme Inhibition Constant Data from BindingDB
Found 1 hit for monomerid = 414453
TargetN-formyl peptide receptor 2(Homo sapiens (Human))
Allergan
US Patent
LigandPNGBDBM414453(N-(4-bromophenyl)-2-(4-ethyl-4- methyl-2,5-dioxoim...)
Affinity DataEC50:  485nM. Assay description: HEK-Gα16 cells stably expressing the human FPR2 receptor was utilized. Cells were plated into 384-well poly-D-lysine coated plates at a density ...
Ligand InfoPC cidPC sid
In DepthDetails US Patent