BDBM414529 N-(2-((2-(dimethylamino)ethyl)(methyl)amino)-4-methoxy-5-((4-(1-methyl-1H-pyrrolo[2,3-b]pyridin-5-yl)-5-(trifluoromethyl)pyrimidin-2-yl)amino)phenyl)acrylamide ::US10435400, Compound Z-22
SMILES COc1cc(N(C)CCN(C)C)c(NC(=O)C=C)cc1Nc1ncc(c(n1)-c1cnc2n(C)ccc2c1)C(F)(F)F
InChI Key InChIKey=LQCWPTXQHJXMBZ-UHFFFAOYSA-N
Data  2 IC50
  Tab Delimited (TSV)   2D SDfile   Computed 3D by Vconf -m prep SDfile
Find this compound or compounds like it in BindingDB:
Activity Spreadsheet -- Enzyme Inhibition Constant Data from BindingDB
Found 2 hits for monomerid = 414529
TargetEpidermal growth factor receptor(Homo sapiens (Human))
Shanghai Haiyan Pharmaceutical Technology
US Patent
LigandPNGBDBM414529(N-(2-((2-(dimethylamino)ethyl)(methyl)amino)-4-met...)
Affinity DataIC50:  57nM. Assay description: The inhibitory effects of compounds to be tested on double mutant EGFR kinase (EGFR T790M/L858R Kinase) (Invitrogen, PV4879) and wild-type EGFR kinas...
Ligand InfoPC cidPC sid
In DepthDetails US Patent
TargetEpidermal growth factor receptor [T790M,L858R](Homo sapiens (Human))
Shanghai Haiyan Pharmaceutical Technology
US Patent
LigandPNGBDBM414529(N-(2-((2-(dimethylamino)ethyl)(methyl)amino)-4-met...)
Affinity DataIC50:  9nM. Assay description: The inhibitory effects of compounds to be tested on double mutant EGFR kinase (EGFR T790M/L858R Kinase) (Invitrogen, PV4879) and wild-type EGFR kinas...
Ligand InfoPC cidPC sid
In DepthDetails US Patent