BDBM414553 US10435400, Compound Z-94
SMILES COc1cc(N(C)CCN(C)C)c(NC(=O)C=C)cc1Nc1ncc(Cl)c(n1)-c1cn(C)nc1C
InChI Key InChIKey=CNZDWUJAQGQNHE-UHFFFAOYSA-N
Data  2 IC50
  Tab Delimited (TSV)   2D SDfile   Computed 3D by Vconf -m prep SDfile
Find this compound or compounds like it in BindingDB:
Activity Spreadsheet -- Enzyme Inhibition Constant Data from BindingDB
Found 2 hits for monomerid = 414553
TargetEpidermal growth factor receptor(Homo sapiens (Human))
Shanghai Haiyan Pharmaceutical Technology
US Patent
LigandPNGBDBM414553(US10435400, Compound Z-94)
Affinity DataIC50:  20nM. Assay description: The inhibitory effects of compounds to be tested on double mutant EGFR kinase (EGFR T790M/L858R Kinase) (Invitrogen, PV4879) and wild-type EGFR kinas...
Ligand InfoPC cidPC sid
In DepthDetails US Patent
TargetEpidermal growth factor receptor [T790M,L858R](Homo sapiens (Human))
Shanghai Haiyan Pharmaceutical Technology
US Patent
LigandPNGBDBM414553(US10435400, Compound Z-94)
Affinity DataIC50:  2nM. Assay description: The inhibitory effects of compounds to be tested on double mutant EGFR kinase (EGFR T790M/L858R Kinase) (Invitrogen, PV4879) and wild-type EGFR kinas...
Ligand InfoPC cidPC sid
In DepthDetails US Patent