BDBM414567 US10435400, Compound Z-110
SMILES CCN(CC)CCN(C)c1cc(OC)c(Nc2ncc(Cl)c(n2)-c2cnc3n(C)ccc3c2)cc1NC(=O)C=C
InChI Key InChIKey=MCSYUUQZCNJOLR-UHFFFAOYSA-N
Data  2 IC50
  Tab Delimited (TSV)   2D SDfile   Computed 3D by Vconf -m prep SDfile
Find this compound or compounds like it in BindingDB:
Activity Spreadsheet -- Enzyme Inhibition Constant Data from BindingDB
Found 2 hits for monomerid = 414567
TargetEpidermal growth factor receptor(Homo sapiens (Human))
Shanghai Haiyan Pharmaceutical Technology
US Patent
LigandPNGBDBM414567(US10435400, Compound Z-110)
Affinity DataIC50:  40nM. Assay description: The inhibitory effects of compounds to be tested on double mutant EGFR kinase (EGFR T790M/L858R Kinase) (Invitrogen, PV4879) and wild-type EGFR kinas...
Ligand InfoPC cidPC sid
In DepthDetails US Patent
TargetEpidermal growth factor receptor [T790M,L858R](Homo sapiens (Human))
Shanghai Haiyan Pharmaceutical Technology
US Patent
LigandPNGBDBM414567(US10435400, Compound Z-110)
Affinity DataIC50:  7nM. Assay description: The inhibitory effects of compounds to be tested on double mutant EGFR kinase (EGFR T790M/L858R Kinase) (Invitrogen, PV4879) and wild-type EGFR kinas...
Ligand InfoPC cidPC sid
In DepthDetails US Patent