BDBM414608 US10434112, Compound 150::{[2-{[(4- bromophenyl)carbamoyl] amino}-3-(1H-indol-3- yl)propanoyl]amino}acetic acid
SMILES OC(=O)CNC(=O)[C@H](Cc1c[nH]c2ccccc12)NC(=O)Nc1ccc(Br)cc1
InChI Key
Data  1 EC50
  Tab Delimited (TSV)   2D SDfile   Computed 3D by Vconf -m prep SDfile
Find this compound or compounds like it in BindingDB:
Activity Spreadsheet -- Enzyme Inhibition Constant Data from BindingDB
Found 1 hit for monomerid = 414608
TargetN-formyl peptide receptor 2(Homo sapiens (Human))
Allergan
US Patent
LigandPNGBDBM414608(US10434112, Compound 150 | {[2-{[(4- bromophenyl)c...)
Affinity DataEC50:  1.40nM. Assay description: HEK-Gα16 cells stably expressing the human FPR2 receptor was utilized. Cells were plated into 384-well poly-D-lysine coated plates at a density ...
Ligand InfoPC cidPC sid
In DepthDetails US Patent