BDBM414858 N-Methyl-N-[(3R,4S)-3-methyl-1-[(2R)-3,3,3-trifluoro-2-hydroxy-2-methylpropanoyl]piperidin-4-yl]benzamide::US10428024, Compound A32
SMILES C[C@@H]1CN(CC[C@@H]1N(C)C(=O)c1ccccc1)C(=O)[C@@](C)(O)C(F)(F)F
InChI Key InChIKey=TUKRVNCBIZEUNL-HACGYAERSA-N
Data  1 IC50  1 Kd
  Tab Delimited (TSV)   2D SDfile   Computed 3D by Vconf -m prep SDfile
Find this compound or compounds like it in BindingDB:
Activity Spreadsheet -- Enzyme Inhibition Constant Data from BindingDB
Found 2 hits for monomerid = 414858
LigandPNGBDBM414858(N-Methyl-N-[(3R,4S)-3-methyl-1-[(2R)-3,3,3-trifluo...)
Affinity DataKd:  46nM. Assay description: ITC measurements were performed with a VP-ITC micro calorimeter (Microcal, LLC/GE Healthcare Bio-Sciences AB, Uppsala, Sweden). In general titrations...
Ligand InfoPC cidPC sid
In DepthDetails US Patent
LigandPNGBDBM414858(N-Methyl-N-[(3R,4S)-3-methyl-1-[(2R)-3,3,3-trifluo...)
Affinity DataIC50:  710nM. Assay description: The PDC inactivation assay is performed in Greiner 384-well microtiter plates and is used for high throughput screen. 4 μl of PDHK2 (human, rec,...
Ligand InfoPC cidPC sid
In DepthDetails US Patent