BDBM414867 4-Cyano-N-methyl-N-[(3S,4R)-3-methyl-1-[(2R)-3,3,3-trifluoro-2-hydroxy-2-methylpropanoyl]piperidin-4-yl]benzamide::US10428024, Compound A45
SMILES C[C@H]1CN(CC[C@H]1N(C)C(=O)c1ccc(cc1)C#N)C(=O)[C@@](C)(O)C(F)(F)F
InChI Key InChIKey=MEVKEPOQYHRQEV-WBHUJUFNSA-N
Data  1 IC50
  Tab Delimited (TSV)   2D SDfile   Computed 3D by Vconf -m prep SDfile
Find this compound or compounds like it in BindingDB:
Activity Spreadsheet -- Enzyme Inhibition Constant Data from BindingDB
Found 1 hit for monomerid = 414867
LigandPNGBDBM414867(4-Cyano-N-methyl-N-[(3S,4R)-3-methyl-1-[(2R)-3,3,3...)
Affinity DataIC50:  2.70E+4nM. Assay description: The PDC inactivation assay is performed in Greiner 384-well microtiter plates and is used for high throughput screen. 4 μl of PDHK2 (human, rec,...
Ligand InfoPC cidPC sid
In DepthDetails US Patent