BDBM414897 US10428028, Coding A13
SMILES Nc1ccccc1NC(=O)c1ccc2nn(Cc3cccnc3)cc2c1
InChI Key InChIKey=XWYGHQUHRIXAOW-UHFFFAOYSA-N
Data  3 IC50
  Tab Delimited (TSV)   2D SDfile   Computed 3D by Vconf -m prep SDfile
Find this compound or compounds like it in BindingDB:
Activity Spreadsheet -- Enzyme Inhibition Constant Data from BindingDB
Found 3 hits for monomerid = 414897
TargetHistone deacetylase 1(Homo sapiens (Human))
Biomarin Pharmaceutical
US Patent
LigandPNGBDBM414897(US10428028, Coding A13)
Affinity DataIC50: <1.00E+3nM. Assay description: The HDAC activity inhibition assay was performed as follows to determine the ability of a test compound to inhibit HDAC enzymatic activity. Serial di...
Ligand InfoPC cidPC sid
In DepthDetails US Patent
TargetHistone deacetylase 3(Homo sapiens (Human))
Biomarin Pharmaceutical
US Patent
LigandPNGBDBM414897(US10428028, Coding A13)
Affinity DataIC50: <1.00E+3nM. Assay description: The HDAC activity inhibition assay was performed as follows to determine the ability of a test compound to inhibit HDAC enzymatic activity. Serial di...
Ligand InfoPC cidPC sid
In DepthDetails US Patent
TargetHistone deacetylase 2(Homo sapiens (Human))
Biomarin Pharmaceutical
US Patent
LigandPNGBDBM414897(US10428028, Coding A13)
Affinity DataIC50: <1.00E+3nM. Assay description: The HDAC activity inhibition assay was performed as follows to determine the ability of a test compound to inhibit HDAC enzymatic activity. Serial di...
Ligand InfoPC cidPC sid
In DepthDetails US Patent