BDBM415447 3-[(3-fluorophenyl)amino]-2-[3-(2-methoxyethoxy)pyridin-4-yl]-1,5,6,7-tetrahydro-4H-pyrrolo[3,2-c]pyridin-4-one::US10428063, Example 47
SMILES COCCOc1cnccc1-c1[nH]c2CCNC(=O)c2c1Nc1cccc(F)c1
InChI Key InChIKey=JTNQRYYGVCULTJ-UHFFFAOYSA-N
Data  1 IC50
  Tab Delimited (TSV)   2D SDfile   Computed 3D by Vconf -m prep SDfile
Find this compound or compounds like it in BindingDB:
Activity Spreadsheet -- Enzyme Inhibition Constant Data from BindingDB
Found 1 hit for monomerid = 415447
TargetMitotic checkpoint serine/threonine-protein kinase BUB1 [704-1085](Homo sapiens (Human))
Bayer Pharma Aktiengesellschaft
US Patent
LigandPNGBDBM415447(3-[(3-fluorophenyl)amino]-2-[3-(2-methoxyethoxy)py...)
Affinity DataIC50:  19.4nM. Assay description: In a typical assay 11 different concentrations of each compound (0.1 nM, 0.33 nM, 1.1 nM, 3.8 nM, 13 nM, 44 nM, 0.15 μM, 0.51 μM, 1.7 μ...
Ligand InfoPC cidPC sid
In DepthDetails US Patent